{"text_format":"1","workbook":"xlsx","n_sheets":3,"sheets":["Version","Temperature Checks","Print-out"],"not_rendered":{"charts":0,"images":0,"macros":1,"external_links":1,"defined_names":5,"comments":0,"pivot_tables":0},"unopened":[],"bounds":{"document_bytes":16777216,"sheet_cells":100000,"rows_first":2000,"rows_last":500,"rows_between":2000,"halvings":0,"cell_chars":16384,"cell_head_chars":4096},"cells_cut":0,"cells_raw":0,"read":"whole","date_system":"1900"}

{"sheet":"Version","index":0,"n_rows":23,"n_cols":1,"rows_kept":23,"cut":false,"hidden":false,"merged":[]}
["Version history notes for the master temperature checks spreadsheet"]
["For more information or to request upgrades, please contact:"]
["     Stewart Rounds, USGS Oregon Water Science Center, 503-251-3280, sarounds@usgs.gov"]
[]
["Version 1.03 (24-Sep-2018)"]
["     Changed the formulas on the Print-out worksheet to increase the number of dates per sensor that are allowed in the drop-down list."]
["     Now, up to 73 dates can be accommodated; the previous maximum was 12."]
[]
["Version 1.02 (3-Nov-2010)"]
["     Columns were added to the Temperature Checks worksheet to accommodate two additional pairs of temperaure checks, for a"]
{"$rows_left_out":14}
{"sheet":"Temperature Checks","index":1,"n_rows":500,"n_cols":112,"rows_kept":500,"cut":false,"hidden":false,"merged":[[4,89,4,99],[4,101,4,111],[2,24,4,24],[2,25,4,25],[2,26,4,26],[2,27,4,27],[3,89,3,111],[4,29,4,40],[4,41,4,52],[4,53,4,64],[4,65,4,76],[4,77,4,88],[1,0,1,1],[2,28,4,28],[2,11,4,11],[2,8,4,8],[2,9,4,9],[2,10,4,10],[2,12,4,12],[2,13,4,13],[2,14,4,14],[2,15,4,15],[2,0,4,0],[2,1,4,1],[2,2,4,2],[2,3,4,3],[2,4,4,4],[2,6,4,6],[2,5,4,5],[0,5,0,10],[2,21,4,21],[2,22,4,22],[2,23,4,23],[2,17,4,17],[2,18,4,18],[2,19,4,19],[2,20,4,20],[2,16,4,16],[2,7,4,7]]}
["Temperature Probe Performance Checks",null,null,null,null,"Please do not use \"drag and drop.\"  Turn it off under Tools/Options/Edit or ExcelOptions/Advanced/Edit.\nAlso, do not cut/paste.  Use copy/paste then delete to move input data."]
["version 1.03  (24-Sep-2018)",null,null,null,"For sake of readability, please enter the temperature checks from left to right and from low temperatures to high temperatures."]
["Field\nProbe ID","Date of\nNIST check\n(MM DD YYYY)","OBSERVER","NIST Certified Probe ID","NIST reading\n#1","Field probe reading\n#1","NIST reading\n#2","Field probe reading\n#2","NIST reading\n#3","Field probe reading\n#3","NIST reading\n#4","Field probe reading\n#4","NIST reading\n#5","Field probe reading\n#5","NIST reading\n#6","Field probe reading\n#6","NIST reading\n#7","Field probe reading\n#7","NIST reading\n#8","Field probe reading\n#8","NIST reading\n#9","Field probe reading\n#9","NIST reading\n#10","Field probe reading\n#10","NIST reading\n#11","Field probe reading\n#11","NIST reading\n#12","Field probe reading\n#12","Remarks"]
[null,null,null,null,null,null,null,null,null,null,null,null,null,null,null,null,null,null,null,null,null,null,null,null,null,null,null,null,null,null,null,null,null,null,null,null,null,null,null,null,null,null,null,null,null,null,null,null,null,null,null,null,null,null,null,null,null,null,null,null,null,null,null,null,null,null,null,null,null,null,null,null,null,null,null,null,null,null,null,null,null,null,null,null,null,null,null,null,null,"Figuring out the ranks and positions after the first one"]
[null,null,null,null,null,null,null,null,null,null,null,null,null,null,null,null,null,null,null,null,null,null,null,null,null,null,null,null,null,"Sorted Field Probe Readings (ascending order)",null,null,null,null,null,null,null,null,null,null,null,"Sorted NIST Probe Readings (ascending order)",null,null,null,null,null,null,null,null,null,null,null,"Field probe readings extracted from user input",null,null,null,null,null,null,null,null,null,null,null,"Ranks of unsorted field probe readings (ascending)",null,null,null,null,null,null,null,null,null,null,null,"Sorted positions to put in ascending order",null,null,null,null,null,null,null,null,null,null,null,"Available ranks, minus 2",null,null,null,null,null,null,null,null,null,null,"TmpString","Ranks to use, no blanks"]
["176194","12 12 2017","MAM/WDM","11506500",0.22,0.3,4.95,5,10.050000000000001,10.1,15.03,15,20.010000000000002,20.100000000000001,25.1,25.2,null,null,null,null,null,null,null,null,null,null,null,null,null,{"$f":"IF(BZ6=\"\",\"\",OFFSET($D6,0,2*BZ6))","v":0.3},5,10.1,15,20.100000000000001,25.2,"","","","","","",{"$f":"IF(BZ6=\"\",\"\",IF(COUNT(OFFSET($D6,0,2*BZ6-1,1,2))=2,OFFSET($D6,0,2*BZ6-1),\"\"))","v":0.22},{"$f":"IF(CA6=\"\",\"\",IF(COUNT(OFFSET($D6,0,2*CA6-1,1,2))=2,OFFSET($D6,0,2*CA6-1),\"\"))","v":4.95},10.050000000000001,15.03,20.010000000000002,25.1,"","","","","","",{"$f":"IF(AND(E6<>\"\",F6<>\"\"),F6,\"\")","v":0.3},{"$f":"IF(AND(G6<>\"\",H6<>\"\"),H6,\"\")","v":5},{"$f":"IF(AND(I6<>\"\",J6<>\"\"),J6,\"\")","v":10.1},{"$f":"IF(AND(K6<>\"\",L6<>\"\"),L6,\"\")","v":15},{"$f":"IF(AND(M6<>\"\",N6<>\"\"),N6,\"\")","v":20.100000000000001},{"$f":"IF(AND(O6<>\"\",P6<>\"\"),P6,\"\")","v":25.2},{"$f":"IF(AND(Q6<>\"\",R6<>\"\"),R6,\"\")","v":""},{"$f":"IF(AND(S6<>\"\",T6<>\"\"),T6,\"\")","v":""},{"$f":"IF(AND(U6<>\"\",V6<>\"\"),V6,\"\")","v":""},{"$f":"IF(AND(W6<>\"\",X6<>\"\"),X6,\"\")","v":""},{"$f":"IF(AND(Y6<>\"\",Z6<>\"\"),Z6,\"\")","v":""},{"$f":"IF(AND(AA6<>\"\",AB6<>\"\"),AB6,\"\")","v":""},{"$f":"IF(BB6<>\"\",RANK(BB6,$BB6:$BM6,1),\"\")","v":1},2,3,4,5,6,"","","","","","",{"$f":"IF(ISNA(MATCH(1,$BN6:$BY6,0)),\"\",MATCH(1,$BN6:$BY6,0))","v":1},{"$f":"IF(COUNT($CL6:$CV6)<1,\"\",MATCH(VALUE(CX6),$BN6:$BY6,0))","v":2},{"$f":"IF(COUNT($CL6:$CV6)<2,\"\",MATCH(VALUE(CY6),$BN6:$BY6,0))","v":3},{"$f":"IF(COUNT($CL6:$CV6)<3,\"\",MATCH(VALUE(CZ6),$BN6:$BY6,0))","v":4},{"$f":"IF(COUNT($CL6:$CV6)<4,\"\",MATCH(VALUE(DA6),$BN6:$BY6,0))","v":5},{"$f":"IF(COUNT($CL6:$CV6)<5,\"\",MATCH(VALUE(DB6),$BN6:$BY6,0))","v":6},{"$f":"IF(COUNT($CL6:$CV6)<6,\"\",MATCH(VALUE(DC6),$BN6:$BY6,0))","v":""},{"$f":"IF(COUNT($CL6:$CV6)<7,\"\",MATCH(VALUE(DD6),$BN6:$BY6,0))","v":""},{"$f":"IF(COUNT($CL6:$CV6)<8,\"\",MATCH(VALUE(DE6),$BN6:$BY6,0))","v":""},{"$f":"IF(COUNT($CL6:$CV6)<9,\"\",MATCH(VALUE(DF6),$BN6:$BY6,0))","v":""},{"$f":"IF(COUNT($CL6:$CV6)<10,\"\",MATCH(VALUE(DG6),$BN6:$BY6,0))","v":""},{"$f":"IF(COUNT($CL6:$CV6)<11,\"\",MATCH(VALUE(DH6),$BN6:$BY6,0))","v":""},{"$f":"IF(AND(COUNT($BN6:$BY6)>1,NOT(ISNA(MATCH(2,$BN6:$BY6,0)))),0,\"\")","v":0},{"$f":"IF(AND(COUNT($BN6:$BY6)>2,NOT(ISNA(MATCH(3,$BN6:$BY6,0)))),1,\"\")","v":1},{"$f":"IF(AND(COUNT($BN6:$BY6)>3,NOT(ISNA(MATCH(4,$BN6:$BY6,0)))),2,\"\")","v":2},{"$f":"IF(AND(COUNT($BN6:$BY6)>4,NOT(ISNA(MATCH(5,$BN6:$BY6,0)))),3,\"\")","v":3},{"$f":"IF(AND(COUNT($BN6:$BY6)>5,NOT(ISNA(MATCH(6,$BN6:$BY6,0)))),4,\"\")","v":4},{"$f":"IF(AND(COUNT($BN6:$BY6)>6,NOT(ISNA(MATCH(7,$BN6:$BY6,0)))),5,\"\")","v":""},{"$f":"IF(AND(COUNT($BN6:$BY6)>7,NOT(ISNA(MATCH(8,$BN6:$BY6,0)))),6,\"\")","v":""},{"$f":"IF(AND(COUNT($BN6:$BY6)>8,NOT(ISNA(MATCH(9,$BN6:$BY6,0)))),7,\"\")","v":""},{"$f":"IF(AND(COUNT($BN6:$BY6)>9,NOT(ISNA(MATCH(10,$BN6:$BY6,0)))),8,\"\")","v":""},{"$f":"IF(AND(COUNT($BN6:$BY6)>10,NOT(ISNA(MATCH(11,$BN6:$BY6,0)))),9,\"\")","v":""},{"$f":"IF(AND(COUNT($BN6:$BY6)>11,NOT(ISNA(MATCH(12,$BN6:$BY6,0)))),10,\"\")","v":""},{"$f":"CONCATENATE(CL6,CM6,CN6,CO6,CP6,CQ6,CR6,CS6,CT6,CU6,IF(CV6=10,\"A\",\"\"))","v":"01234"},{"$f":"IF(MID($CW6,1,1)=\"\",\"\",IF(MID($CW6,1,1)=\"A\",12,MID($CW6,1,1)+2))","v":2},{"$f":"IF(MID($CW6,2,1)=\"\",\"\",IF(MID($CW6,2,1)=\"A\",12,MID($CW6,2,1)+2))","v":3},{"$f":"IF(MID($CW6,3,1)=\"\",\"\",IF(MID($CW6,3,1)=\"A\",12,MID($CW6,3,1)+2))","v":4},{"$f":"IF(MID($CW6,4,1)=\"\",\"\",IF(MID($CW6,4,1)=\"A\",12,MID($CW6,4,1)+2))","v":5},{"$f":"IF(MID($CW6,5,1)=\"\",\"\",IF(MID($CW6,5,1)=\"A\",12,MID($CW6,5,1)+2))","v":6},{"$f":"IF(MID($CW6,6,1)=\"\",\"\",IF(MID($CW6,6,1)=\"A\",12,MID($CW6,6,1)+2))","v":""},{"$f":"IF(MID($CW6,7,1)=\"\",\"\",IF(MID($CW6,7,1)=\"A\",12,MID($CW6,7,1)+2))","v":""},{"$f":"IF(MID($CW6,8,1)=\"\",\"\",IF(MID($CW6,8,1)=\"A\",12,MID($CW6,8,1)+2))","v":""},{"$f":"IF(MID($CW6,9,1)=\"\",\"\",IF(MID($CW6,9,1)=\"A\",12,MID($CW6,9,1)+2))","v":""},{"$f":"IF(MID($CW6,10,1)=\"\",\"\",IF(MID($CW6,10,1)=\"A\",12,MID($CW6,10,1)+2))","v":""},{"$f":"IF(MID($CW6,11,1)=\"\",\"\",IF(MID($CW6,11,1)=\"A\",12,MID($CW6,11,1)+2))","v":""}]
["176194","03 27 2018","LMH","11506500",0.35,0.4,5.05,5.0999999999999996,10.097,10.1,15.092000000000001,15.1,20.047000000000001,20.100000000000001,25.07,25,null,null,null,null,null,null,null,null,null,null,null,null,null,{"$f":"IF(BZ7=\"\",\"\",OFFSET($D7,0,2*BZ7))","v":0.4},{"$f":"IF(CA7=\"\",\"\",OFFSET($D7,0,2*CA7))","v":5.0999999999999996},{"$f":"IF(CB7=\"\",\"\",OFFSET($D7,0,2*CB7))","v":10.1},{"$f":"IF(CC7=\"\",\"\",OFFSET($D7,0,2*CC7))","v":15.1},{"$f":"IF(CD7=\"\",\"\",OFFSET($D7,0,2*CD7))","v":20.100000000000001},{"$f":"IF(CE7=\"\",\"\",OFFSET($D7,0,2*CE7))","v":25},{"$f":"IF(CF7=\"\",\"\",OFFSET($D7,0,2*CF7))","v":""},{"$f":"IF(CG7=\"\",\"\",OFFSET($D7,0,2*CG7))","v":""},{"$f":"IF(CH7=\"\",\"\",OFFSET($D7,0,2*CH7))","v":""},{"$f":"IF(CI7=\"\",\"\",OFFSET($D7,0,2*CI7))","v":""},{"$f":"IF(CJ7=\"\",\"\",OFFSET($D7,0,2*CJ7))","v":""},{"$f":"IF(CK7=\"\",\"\",OFFSET($D7,0,2*CK7))","v":""},{"$f":"IF(BZ7=\"\",\"\",IF(COUNT(OFFSET($D7,0,2*BZ7-1,1,2))=2,OFFSET($D7,0,2*BZ7-1),\"\"))","v":0.35},{"$f":"IF(CA7=\"\",\"\",IF(COUNT(OFFSET($D7,0,2*CA7-1,1,2))=2,OFFSET($D7,0,2*CA7-1),\"\"))","v":5.05},{"$f":"IF(CB7=\"\",\"\",IF(COUNT(OFFSET($D7,0,2*CB7-1,1,2))=2,OFFSET($D7,0,2*CB7-1),\"\"))","v":10.097},{"$f":"IF(CC7=\"\",\"\",IF(COUNT(OFFSET($D7,0,2*CC7-1,1,2))=2,OFFSET($D7,0,2*CC7-1),\"\"))","v":15.092000000000001},{"$f":"IF(CD7=\"\",\"\",IF(COUNT(OFFSET($D7,0,2*CD7-1,1,2))=2,OFFSET($D7,0,2*CD7-1),\"\"))","v":20.047000000000001},{"$f":"IF(CE7=\"\",\"\",IF(COUNT(OFFSET($D7,0,2*CE7-1,1,2))=2,OFFSET($D7,0,2*CE7-1),\"\"))","v":25.07},{"$f":"IF(CF7=\"\",\"\",IF(COUNT(OFFSET($D7,0,2*CF7-1,1,2))=2,OFFSET($D7,0,2*CF7-1),\"\"))","v":""},{"$f":"IF(CG7=\"\",\"\",IF(COUNT(OFFSET($D7,0,2*CG7-1,1,2))=2,OFFSET($D7,0,2*CG7-1),\"\"))","v":""},{"$f":"IF(CH7=\"\",\"\",IF(COUNT(OFFSET($D7,0,2*CH7-1,1,2))=2,OFFSET($D7,0,2*CH7-1),\"\"))","v":""},{"$f":"IF(CI7=\"\",\"\",IF(COUNT(OFFSET($D7,0,2*CI7-1,1,2))=2,OFFSET($D7,0,2*CI7-1),\"\"))","v":""},{"$f":"IF(CJ7=\"\",\"\",IF(COUNT(OFFSET($D7,0,2*CJ7-1,1,2))=2,OFFSET($D7,0,2*CJ7-1),\"\"))","v":""},{"$f":"IF(CK7=\"\",\"\",IF(COUNT(OFFSET($D7,0,2*CK7-1,1,2))=2,OFFSET($D7,0,2*CK7-1),\"\"))","v":""},{"$f":"IF(AND(E7<>\"\",F7<>\"\"),F7,\"\")","v":0.4},{"$f":"IF(AND(G7<>\"\",H7<>\"\"),H7,\"\")","v":5.0999999999999996},{"$f":"IF(AND(I7<>\"\",J7<>\"\"),J7,\"\")","v":10.1},{"$f":"IF(AND(K7<>\"\",L7<>\"\"),L7,\"\")","v":15.1},{"$f":"IF(AND(M7<>\"\",N7<>\"\"),N7,\"\")","v":20.100000000000001},{"$f":"IF(AND(O7<>\"\",P7<>\"\"),P7,\"\")","v":25},{"$f":"IF(AND(Q7<>\"\",R7<>\"\"),R7,\"\")","v":""},{"$f":"IF(AND(S7<>\"\",T7<>\"\"),T7,\"\")","v":""},{"$f":"IF(AND(U7<>\"\",V7<>\"\"),V7,\"\")","v":""},{"$f":"IF(AND(W7<>\"\",X7<>\"\"),X7,\"\")","v":""},{"$f":"IF(AND(Y7<>\"\",Z7<>\"\"),Z7,\"\")","v":""},{"$f":"IF(AND(AA7<>\"\",AB7<>\"\"),AB7,\"\")","v":""},{"$f":"IF(BB7<>\"\",RANK(BB7,$BB7:$BM7,1),\"\")","v":1},{"$f":"IF(BC7<>\"\",RANK(BC7,$BB7:$BM7,1),\"\")","v":2},{"$f":"IF(BD7<>\"\",RANK(BD7,$BB7:$BM7,1),\"\")","v":3},{"$f":"IF(BE7<>\"\",RANK(BE7,$BB7:$BM7,1),\"\")","v":4},{"$f":"IF(BF7<>\"\",RANK(BF7,$BB7:$BM7,1),\"\")","v":5},{"$f":"IF(BG7<>\"\",RANK(BG7,$BB7:$BM7,1),\"\")","v":6},{"$f":"IF(BH7<>\"\",RANK(BH7,$BB7:$BM7,1),\"\")","v":""},{"$f":"IF(BI7<>\"\",RANK(BI7,$BB7:$BM7,1),\"\")","v":""},{"$f":"IF(BJ7<>\"\",RANK(BJ7,$BB7:$BM7,1),\"\")","v":""},{"$f":"IF(BK7<>\"\",RANK(BK7,$BB7:$BM7,1),\"\")","v":""},{"$f":"IF(BL7<>\"\",RANK(BL7,$BB7:$BM7,1),\"\")","v":""},{"$f":"IF(BM7<>\"\",RANK(BM7,$BB7:$BM7,1),\"\")","v":""},{"$f":"IF(ISNA(MATCH(1,$BN7:$BY7,0)),\"\",MATCH(1,$BN7:$BY7,0))","v":1},{"$f":"IF(COUNT($CL7:$CV7)<1,\"\",MATCH(VALUE(CX7),$BN7:$BY7,0))","v":2},{"$f":"IF(COUNT($CL7:$CV7)<2,\"\",MATCH(VALUE(CY7),$BN7:$BY7,0))","v":3},{"$f":"IF(COUNT($CL7:$CV7)<3,\"\",MATCH(VALUE(CZ7),$BN7:$BY7,0))","v":4},{"$f":"IF(COUNT($CL7:$CV7)<4,\"\",MATCH(VALUE(DA7),$BN7:$BY7,0))","v":5},{"$f":"IF(COUNT($CL7:$CV7)<5,\"\",MATCH(VALUE(DB7),$BN7:$BY7,0))","v":6},{"$f":"IF(COUNT($CL7:$CV7)<6,\"\",MATCH(VALUE(DC7),$BN7:$BY7,0))","v":""},{"$f":"IF(COUNT($CL7:$CV7)<7,\"\",MATCH(VALUE(DD7),$BN7:$BY7,0))","v":""},{"$f":"IF(COUNT($CL7:$CV7)<8,\"\",MATCH(VALUE(DE7),$BN7:$BY7,0))","v":""},{"$f":"IF(COUNT($CL7:$CV7)<9,\"\",MATCH(VALUE(DF7),$BN7:$BY7,0))","v":""},{"$f":"IF(COUNT($CL7:$CV7)<10,\"\",MATCH(VALUE(DG7),$BN7:$BY7,0))","v":""},{"$f":"IF(COUNT($CL7:$CV7)<11,\"\",MATCH(VALUE(DH7),$BN7:$BY7,0))","v":""},{"$f":"IF(AND(COUNT($BN7:$BY7)>1,NOT(ISNA(MATCH(2,$BN7:$BY7,0)))),0,\"\")","v":0},{"$f":"IF(AND(COUNT($BN7:$BY7)>2,NOT(ISNA(MATCH(3,$BN7:$BY7,0)))),1,\"\")","v":1},{"$f":"IF(AND(COUNT($BN7:$BY7)>3,NOT(ISNA(MATCH(4,$BN7:$BY7,0)))),2,\"\")","v":2},{"$f":"IF(AND(COUNT($BN7:$BY7)>4,NOT(ISNA(MATCH(5,$BN7:$BY7,0)))),3,\"\")","v":3},{"$f":"IF(AND(COUNT($BN7:$BY7)>5,NOT(ISNA(MATCH(6,$BN7:$BY7,0)))),4,\"\")","v":4},{"$f":"IF(AND(COUNT($BN7:$BY7)>6,NOT(ISNA(MATCH(7,$BN7:$BY7,0)))),5,\"\")","v":""},{"$f":"IF(AND(COUNT($BN7:$BY7)>7,NOT(ISNA(MATCH(8,$BN7:$BY7,0)))),6,\"\")","v":""},{"$f":"IF(AND(COUNT($BN7:$BY7)>8,NOT(ISNA(MATCH(9,$BN7:$BY7,0)))),7,\"\")","v":""},{"$f":"IF(AND(COUNT($BN7:$BY7)>9,NOT(ISNA(MATCH(10,$BN7:$BY7,0)))),8,\"\")","v":""},{"$f":"IF(AND(COUNT($BN7:$BY7)>10,NOT(ISNA(MATCH(11,$BN7:$BY7,0)))),9,\"\")","v":""},{"$f":"IF(AND(COUNT($BN7:$BY7)>11,NOT(ISNA(MATCH(12,$BN7:$BY7,0)))),10,\"\")","v":""},{"$f":"CONCATENATE(CL7,CM7,CN7,CO7,CP7,CQ7,CR7,CS7,CT7,CU7,IF(CV7=10,\"A\",\"\"))","v":"01234"},{"$f":"IF(MID($CW7,1,1)=\"\",\"\",IF(MID($CW7,1,1)=\"A\",12,MID($CW7,1,1)+2))","v":2},{"$f":"IF(MID($CW7,2,1)=\"\",\"\",IF(MID($CW7,2,1)=\"A\",12,MID($CW7,2,1)+2))","v":3},{"$f":"IF(MID($CW7,3,1)=\"\",\"\",IF(MID($CW7,3,1)=\"A\",12,MID($CW7,3,1)+2))","v":4},{"$f":"IF(MID($CW7,4,1)=\"\",\"\",IF(MID($CW7,4,1)=\"A\",12,MID($CW7,4,1)+2))","v":5},{"$f":"IF(MID($CW7,5,1)=\"\",\"\",IF(MID($CW7,5,1)=\"A\",12,MID($CW7,5,1)+2))","v":6},{"$f":"IF(MID($CW7,6,1)=\"\",\"\",IF(MID($CW7,6,1)=\"A\",12,MID($CW7,6,1)+2))","v":""},{"$f":"IF(MID($CW7,7,1)=\"\",\"\",IF(MID($CW7,7,1)=\"A\",12,MID($CW7,7,1)+2))","v":""},{"$f":"IF(MID($CW7,8,1)=\"\",\"\",IF(MID($CW7,8,1)=\"A\",12,MID($CW7,8,1)+2))","v":""},{"$f":"IF(MID($CW7,9,1)=\"\",\"\",IF(MID($CW7,9,1)=\"A\",12,MID($CW7,9,1)+2))","v":""},{"$f":"IF(MID($CW7,10,1)=\"\",\"\",IF(MID($CW7,10,1)=\"A\",12,MID($CW7,10,1)+2))","v":""},{"$f":"IF(MID($CW7,11,1)=\"\",\"\",IF(MID($CW7,11,1)=\"A\",12,MID($CW7,11,1)+2))","v":""}]
["2475446","5 10 2018","WDM","11506500",0,0,5,5,10,10.1,15,15,20,20.100000000000001,25,25.1,30,30.1,null,null,null,null,null,null,null,null,null,null,null,0,5,10.1,15,20.100000000000001,25.1,30.1,"","","","","",0,5,10,15,20,25,30,"","","","","",0,5,10.1,15,20.100000000000001,25.1,30.1,"","","","","",1,2,3,4,5,6,7,"","","","","",1,2,3,4,5,6,7,"","","","","",0,1,2,3,4,5,"","","","","","012345",2,3,4,5,6,7,"","","","",""]
["176194","6 11 2018","MAM","11506500",0.03,0.1,4.9800000000000004,5,10,10,15.01,15,20.03,20,25.1,25.2,null,null,null,null,null,null,null,null,null,null,null,null,null,0.1,5,10,15,20,25.2,"","","","","","",0.03,4.9800000000000004,10,15.01,20.03,25.1,"","","","","","",0.1,5,10,15,20,25.2,"","","","","","",1,2,3,4,5,6,"","","","","","",1,2,3,4,5,6,"","","","","","",0,1,2,3,4,"","","","","","","01234",2,3,4,5,6,"","","","","",""]
[null,null,null,null,null,null,null,null,null,null,null,null,null,null,null,null,null,null,null,null,null,null,null,null,null,null,null,null,null,"","","","","","","","","","","","","","","","","","","","","","","","","","","","","","","","","","","","","","","","","","","","","","","","","","","","","","","","","","","","","","","","","","","","","","","","","","","","","","","","","","",""]
{"$rows_left_out":491}
{"sheet":"Print-out","index":2,"n_rows":73,"n_cols":26,"rows_kept":73,"cut":false,"hidden":false,"merged":[[16,0,16,2],[17,0,17,2],[16,3,16,5],[17,3,17,5],[15,0,15,2],[4,3,4,5],[5,3,5,5],[6,3,6,5],[7,3,7,5],[8,3,8,5],[10,0,10,2],[5,0,5,2],[11,0,11,2],[15,3,15,5],[9,0,9,2],[10,3,10,5],[11,3,11,5],[12,3,12,5],[0,4,0,6],[3,0,3,6],[1,7,1,10],[14,3,14,5],[13,3,13,5],[12,0,12,2],[13,0,13,2],[14,0,14,2],[4,0,4,2],[1,4,1,6],[0,2,0,3],[1,2,1,3],[6,0,6,2],[7,0,7,2],[8,0,8,2],[9,3,9,5]]}
[null,null,"Field Probe ID:  ",null,"176194",null,null,null,null,{"$f":"IF($E2=\"\",\"\",IF(ISNA(MATCH($E2,$Z$1:$Z$73,0)),\"\",SUM(OFFSET($Y1,0,0,MATCH($E2,$Z$1:$Z$73,0),1))))","v":4},"Observer: ",{"$f":"IF($J$1=\"\",\"\",IF(INDEX('Temperature Checks'!$C$6:$C$500,$J$1,1)=\"\",\"\",INDEX('Temperature Checks'!$C$6:$C$500,$J$1,1)))","v":"MAM"},null,null,null,null,null,null,null,null,null,null,null,null,{"$f":"IF(ISNA(MATCH($E$1,'Temperature Checks'!$A$6:$A$500,0)),0,MATCH($E$1,'Temperature Checks'!$A$6:$A$500,0))","v":1},{"$f":"IF($Y1=0,\"\",INDEX('Temperature Checks'!$B$6:$B$500,$Y1))","v":"12 12 2017"}]
[null,null,"Date of Check:  ",null,"6 11 2018",null,null,"NIST certified probe ID: ",null,null,null,{"$f":"IF($J$1=\"\",\"\",IF(INDEX('Temperature Checks'!$D$6:$D$500,$J$1,1)=\"\",\"\",INDEX('Temperature Checks'!$D$6:$D$500,$J$1,1)))","v":"11506500"},null,null,null,null,null,null,null,null,null,null,null,null,{"$f":"IF(ISNA(MATCH($E$1,OFFSET('Temperature Checks'!$A$6,$Y1,0,495-$Y1,1),0)),0,MATCH($E$1,OFFSET('Temperature Checks'!$A$6,$Y1,0,495-$Y1,1),0))","v":1},{"$f":"IF($Y2=0,\"\",INDEX('Temperature Checks'!$B$6:$B$500,SUM($Y$1:$Y2)))","v":"03 27 2018"}]
[null,null,null,null,null,null,null,null,null,null,null,null,null,null,null,null,null,null,null,null,null,null,null,null,{"$f":"IF(ISNA(MATCH($E$1,OFFSET('Temperature Checks'!$A$6,SUM($Y$1:$Y2),0,495-SUM($Y$1:$Y2),1),0)),0,MATCH($E$1,OFFSET('Temperature Checks'!$A$6,SUM($Y$1:$Y2),0,495-SUM($Y$1:$Y2),1),0))","v":2},{"$f":"IF($Y3=0,\"\",INDEX('Temperature Checks'!$B$6:$B$500,SUM($Y$1:$Y3)))","v":"6 11 2018"}]
["Temperature Checks (°C)",null,null,null,null,null,null,null,null,null,null,null,null,null,null,null,null,null,null,null,null,null,null,null,{"$f":"IF(ISNA(MATCH($E$1,OFFSET('Temperature Checks'!$A$6,SUM($Y$1:$Y3),0,495-SUM($Y$1:$Y3),1),0)),0,MATCH($E$1,OFFSET('Temperature Checks'!$A$6,SUM($Y$1:$Y3),0,495-SUM($Y$1:$Y3),1),0))","v":0},{"$f":"IF($Y4=0,\"\",INDEX('Temperature Checks'!$B$6:$B$500,SUM($Y$1:$Y4)))","v":""}]
["NIST",null,null,"Field",null,null,"Probe",null,null,null,"Field","Corrected",null,null,"Field","Corrected",null,null,"Field","Corrected",null,null,"Field","Corrected",{"$f":"IF(ISNA(MATCH($E$1,OFFSET('Temperature Checks'!$A$6,SUM($Y$1:$Y4),0,495-SUM($Y$1:$Y4),1),0)),0,MATCH($E$1,OFFSET('Temperature Checks'!$A$6,SUM($Y$1:$Y4),0,495-SUM($Y$1:$Y4),1),0))","v":0},{"$f":"IF($Y5=0,\"\",INDEX('Temperature Checks'!$B$6:$B$500,SUM($Y$1:$Y5)))","v":""}]
["Thermometer",null,null,"Probe",null,null,"Error",null,null,null,"Probe","NIST",null,null,"Probe","NIST",null,null,"Probe","NIST",null,null,"Probe","NIST",{"$f":"IF(ISNA(MATCH($E$1,OFFSET('Temperature Checks'!$A$6,SUM($Y$1:$Y5),0,495-SUM($Y$1:$Y5),1),0)),0,MATCH($E$1,OFFSET('Temperature Checks'!$A$6,SUM($Y$1:$Y5),0,495-SUM($Y$1:$Y5),1),0))","v":0},{"$f":"IF($Y6=0,\"\",INDEX('Temperature Checks'!$B$6:$B$500,SUM($Y$1:$Y6)))","v":""}]
[{"$f":"IF($J$1=\"\",\"\",IF(INDEX('Temperature Checks'!$AP$6:$AP$500,$J$1,1)=\"\",\"\",INDEX('Temperature Checks'!$AP$6:$AP$500,$J$1,1)))","v":0.03},null,null,{"$f":"IF($J$1=\"\",\"\",IF(INDEX('Temperature Checks'!$AD$6:$AD$500,$J$1,1)=\"\",\"\",INDEX('Temperature Checks'!$AD$6:$AD$500,$J$1,1)))","v":0.1},null,null,{"$f":"IF(NOT(ISERR(D7-A7)),D7-A7,\"\")","v":7.0000000000000007E-2},null,null,null,"Reading","Reading",null,null,"Reading","Reading",null,null,"Reading","Reading",null,null,"Reading","Reading",{"$f":"IF(ISNA(MATCH($E$1,OFFSET('Temperature Checks'!$A$6,SUM($Y$1:$Y6),0,495-SUM($Y$1:$Y6),1),0)),0,MATCH($E$1,OFFSET('Temperature Checks'!$A$6,SUM($Y$1:$Y6),0,495-SUM($Y$1:$Y6),1),0))","v":0},{"$f":"IF($Y7=0,\"\",INDEX('Temperature Checks'!$B$6:$B$500,SUM($Y$1:$Y7)))","v":""}]
[{"$f":"IF($J$1=\"\",\"\",IF(INDEX('Temperature Checks'!$AQ$6:$AQ$500,$J$1,1)=\"\",\"\",INDEX('Temperature Checks'!$AQ$6:$AQ$500,$J$1,1)))","v":4.9800000000000004},null,null,{"$f":"IF($J$1=\"\",\"\",IF(INDEX('Temperature Checks'!$AE$6:$AE$500,$J$1,1)=\"\",\"\",INDEX('Temperature Checks'!$AE$6:$AE$500,$J$1,1)))","v":5},null,null,1.9999999999999574E-2,null,null,null,"(°C)","(°C)",null,null,"(°C)","(°C)",null,null,"(°C)","(°C)",null,null,"(°C)","(°C)",{"$f":"IF(ISNA(MATCH($E$1,OFFSET('Temperature Checks'!$A$6,SUM($Y$1:$Y7),0,495-SUM($Y$1:$Y7),1),0)),0,MATCH($E$1,OFFSET('Temperature Checks'!$A$6,SUM($Y$1:$Y7),0,495-SUM($Y$1:$Y7),1),0))","v":0},{"$f":"IF($Y8=0,\"\",INDEX('Temperature Checks'!$B$6:$B$500,SUM($Y$1:$Y8)))","v":""}]
[{"$f":"IF($J$1=\"\",\"\",IF(INDEX('Temperature Checks'!$AR$6:$AR$500,$J$1,1)=\"\",\"\",INDEX('Temperature Checks'!$AR$6:$AR$500,$J$1,1)))","v":10},null,null,{"$f":"IF($J$1=\"\",\"\",IF(INDEX('Temperature Checks'!$AF$6:$AF$500,$J$1,1)=\"\",\"\",INDEX('Temperature Checks'!$AF$6:$AF$500,$J$1,1)))","v":10},null,null,0,null,null,{"$f":"IF(COUNT($D$7:$D$18)=0,\"\",IF(ISNA(LOOKUP(K9,$D$7:$D$18,{1,2,3,4,5,6,7,8,9,10,11,12})),0,LOOKUP(K9,$D$7:$D$18,{1,2,3,4,5,6,7,8,9,10,11,12})))","v":3},10,{"$f":"IF(COUNT($D$7:$D$18)=0,\"\",IF(J9=0,K9-$G$7,IF(J9=COUNT($D$7:$D$18),K9-INDEX($G$7:$G$18,COUNT($D$7:$D$18)),K9-(INDEX($G$7:$G$18,J9)+(INDEX($G$7:$G$18,J9+1)-INDEX($G$7:$G$18,J9))*(K9-INDEX($D$7:$D$18,J9))/(INDEX($D$7:$D$18,J9+1)-INDEX($D$7:$D$18,J9))))))","v":10},null,{"$f":"IF(COUNT($D$7:$D$18)=0,\"\",IF(ISNA(LOOKUP(O9,$D$7:$D$18,{1,2,3,4,5,6,7,8,9,10,11,12})),0,LOOKUP(O9,$D$7:$D$18,{1,2,3,4,5,6,7,8,9,10,11,12})))","v":4},16.5,{"$f":"IF(COUNT($D$7:$D$18)=0,\"\",IF(N9=0,O9-$G$7,IF(N9=COUNT($D$7:$D$18),O9-INDEX($G$7:$G$18,COUNT($D$7:$D$18)),O9-(INDEX($G$7:$G$18,N9)+(INDEX($G$7:$G$18,N9+1)-INDEX($G$7:$G$18,N9))*(O9-INDEX($D$7:$D$18,N9))/(INDEX($D$7:$D$18,N9+1)-INDEX($D$7:$D$18,N9))))))","v":16.516000000000002},null,{"$f":"IF(COUNT($D$7:$D$18)=0,\"\",IF(ISNA(LOOKUP(S9,$D$7:$D$18,{1,2,3,4,5,6,7,8,9,10,11,12})),0,LOOKUP(S9,$D$7:$D$18,{1,2,3,4,5,6,7,8,9,10,11,12})))","v":5},23,{"$f":"IF(COUNT($D$7:$D$18)=0,\"\",IF(R9=0,S9-$G$7,IF(R9=COUNT($D$7:$D$18),S9-INDEX($G$7:$G$18,COUNT($D$7:$D$18)),S9-(INDEX($G$7:$G$18,R9)+(INDEX($G$7:$G$18,R9+1)-INDEX($G$7:$G$18,R9))*(S9-INDEX($D$7:$D$18,R9))/(INDEX($D$7:$D$18,R9+1)-INDEX($D$7:$D$18,R9))))))","v":22.955000000000002},null,{"$f":"IF(COUNT($D$7:$D$18)=0,\"\",IF(ISNA(LOOKUP(W9,$D$7:$D$18,{1,2,3,4,5,6,7,8,9,10,11,12})),0,LOOKUP(W9,$D$7:$D$18,{1,2,3,4,5,6,7,8,9,10,11,12})))","v":6},29.5,{"$f":"IF(COUNT($D$7:$D$18)=0,\"\",IF(V9=0,W9-$G$7,IF(V9=COUNT($D$7:$D$18),W9-INDEX($G$7:$G$18,COUNT($D$7:$D$18)),W9-(INDEX($G$7:$G$18,V9)+(INDEX($G$7:$G$18,V9+1)-INDEX($G$7:$G$18,V9))*(W9-INDEX($D$7:$D$18,V9))/(INDEX($D$7:$D$18,V9+1)-INDEX($D$7:$D$18,V9))))))","v":29.400000000000002},{"$f":"IF(ISNA(MATCH($E$1,OFFSET('Temperature Checks'!$A$6,SUM($Y$1:$Y8),0,495-SUM($Y$1:$Y8),1),0)),0,MATCH($E$1,OFFSET('Temperature Checks'!$A$6,SUM($Y$1:$Y8),0,495-SUM($Y$1:$Y8),1),0))","v":0},{"$f":"IF($Y9=0,\"\",INDEX('Temperature Checks'!$B$6:$B$500,SUM($Y$1:$Y9)))","v":""}]
[{"$f":"IF($J$1=\"\",\"\",IF(INDEX('Temperature Checks'!$AS$6:$AS$500,$J$1,1)=\"\",\"\",INDEX('Temperature Checks'!$AS$6:$AS$500,$J$1,1)))","v":15.01},null,null,{"$f":"IF($J$1=\"\",\"\",IF(INDEX('Temperature Checks'!$AG$6:$AG$500,$J$1,1)=\"\",\"\",INDEX('Temperature Checks'!$AG$6:$AG$500,$J$1,1)))","v":15},null,null,-9.9999999999997868E-3,null,null,{"$f":"IF(COUNT($D$7:$D$18)=0,\"\",IF(ISNA(LOOKUP(K10,$D$7:$D$18,{1,2,3,4,5,6,7,8,9,10,11,12})),0,LOOKUP(K10,$D$7:$D$18,{1,2,3,4,5,6,7,8,9,10,11,12})))","v":3},10.1,10.100199999999999,null,{"$f":"IF(COUNT($D$7:$D$18)=0,\"\",IF(ISNA(LOOKUP(O10,$D$7:$D$18,{1,2,3,4,5,6,7,8,9,10,11,12})),0,LOOKUP(O10,$D$7:$D$18,{1,2,3,4,5,6,7,8,9,10,11,12})))","v":4},16.600000000000001,16.616400000000002,null,{"$f":"IF(COUNT($D$7:$D$18)=0,\"\",IF(ISNA(LOOKUP(S10,$D$7:$D$18,{1,2,3,4,5,6,7,8,9,10,11,12})),0,LOOKUP(S10,$D$7:$D$18,{1,2,3,4,5,6,7,8,9,10,11,12})))","v":5},23.1,{"$f":"IF(COUNT($D$7:$D$18)=0,\"\",IF(R10=0,S10-$G$7,IF(R10=COUNT($D$7:$D$18),S10-INDEX($G$7:$G$18,COUNT($D$7:$D$18)),S10-(INDEX($G$7:$G$18,R10)+(INDEX($G$7:$G$18,R10+1)-INDEX($G$7:$G$18,R10))*(S10-INDEX($D$7:$D$18,R10))/(INDEX($D$7:$D$18,R10+1)-INDEX($D$7:$D$18,R10))))))","v":23.052500000000002},null,{"$f":"IF(COUNT($D$7:$D$18)=0,\"\",IF(ISNA(LOOKUP(W10,$D$7:$D$18,{1,2,3,4,5,6,7,8,9,10,11,12})),0,LOOKUP(W10,$D$7:$D$18,{1,2,3,4,5,6,7,8,9,10,11,12})))","v":6},29.6,{"$f":"IF(COUNT($D$7:$D$18)=0,\"\",IF(V10=0,W10-$G$7,IF(V10=COUNT($D$7:$D$18),W10-INDEX($G$7:$G$18,COUNT($D$7:$D$18)),W10-(INDEX($G$7:$G$18,V10)+(INDEX($G$7:$G$18,V10+1)-INDEX($G$7:$G$18,V10))*(W10-INDEX($D$7:$D$18,V10))/(INDEX($D$7:$D$18,V10+1)-INDEX($D$7:$D$18,V10))))))","v":29.500000000000004},{"$f":"IF(ISNA(MATCH($E$1,OFFSET('Temperature Checks'!$A$6,SUM($Y$1:$Y9),0,495-SUM($Y$1:$Y9),1),0)),0,MATCH($E$1,OFFSET('Temperature Checks'!$A$6,SUM($Y$1:$Y9),0,495-SUM($Y$1:$Y9),1),0))","v":0},{"$f":"IF($Y10=0,\"\",INDEX('Temperature Checks'!$B$6:$B$500,SUM($Y$1:$Y10)))","v":""}]
{"$rows_left_out":63}